{"text_format":"2","workbook":"xlsx","n_sheets":13,"sheets":["Instructions","Sheet1","Total","Total Data","Unic Is Co","Unic Is Co Data","Coupeville","Coupeville Data","Langley","Langley Data","Oak Harbor","Oak Harbor Data","NAICS"],"not_rendered":{"charts":5,"images":6,"macros":0,"external_links":0,"defined_names":5,"comments":0,"pivot_tables":5},"unopened":[],"bounds":{"document_bytes":16777216,"sheet_cells":100000,"run_cost":"one","rows_first":2000,"rows_last":500,"rows_between":2000,"halvings":0,"cell_chars":16384,"cell_head_chars":4096},"cells_cut":0,"cells_raw":0,"read":"whole","date_system":"1900"}

{"sheet":"Instructions","index":0,"n_rows":0,"n_cols":0,"rows_kept":0,"cut":false,"hidden":false,"merged":[]}

{"sheet":"Sheet1","index":1,"n_rows":0,"n_cols":0,"rows_kept":0,"cut":false,"hidden":false,"merged":[]}

{"sheet":"Total","index":2,"n_rows":37,"n_cols":23,"rows_kept":37,"cut":false,"hidden":false,"merged":[[0,2,0,6]]}
["NAICS","(All)",{"$f":"VLOOKUP(B1,NAICS!A1:B2600,2,FALSE)","v":{"$error":"#N/A"}}]
[]
["Sum of Total Taxable","Column Labels",{"$nulls":19},"Code","Industry Title"]
["Row Labels","Coupeville","Langley","Oak Harbor","Unic Is Co","Grand Total",{"$nulls":15},11,"Agriculture, Forestry, Fishing and Hunting"]
["2014 Quarter 1",8777594,7397435,72683696,86719458,175578183,{"$nulls":15},21,"Mining"]
["2014 Quarter 2",10657288,9145967,80928322,94258126,194989703,{"$nulls":15},22,"Utilities"]
["2014 Quarter 3",11924741,11487725,83749226,105853873,213015565,{"$nulls":15},23,"Construction"]
["2014 Quarter 4",10237937,9154497,81271950,105315571,205979955,{"$nulls":15},"31-33","Manufacturing"]
["2015 Quarter 1",9519402,7811245,75790719,97265379,190386745,{"$nulls":15},42,"Wholesale Trade"]
["2015 Quarter 2",11073628,8989338,87666274,112560763,220290003,{"$nulls":15},"44-45","Retail Trade"]
["2015 Quarter 3",12691867,12271285,92829278,117678010,235470440,{"$nulls":15},"48-49","Transportation and Warehousing"]
["2015 Quarter 4",14284608,10506084,90965132,113395164,229150988,{"$nulls":15},51,"Information"]
["2016 Quarter 1",15076444,8312506,85008881,103794931,212192762,{"$nulls":15},52,"Finance and Insurance"]
["2016 Quarter 2",16452080,10359931,102904792,121095892,250812695,{"$nulls":15},53,"Real Estate Rental and Leasing"]
["2016 Quarter 3",18081679,13416735,105459441,136129231,273087086,{"$nulls":15},54,"Professional, Scientific, and Technical Services"]
["2016 Quarter 4",17726155,11985075,100246743,130213240,260171213,{"$nulls":15},55,"Management of Companies and Enterprises"]
["2017 Quarter 1",19355964,9468342,94892000,119451295,243167601,{"$nulls":15},56,"Administrative and Support and Waste Management and Remediation Services"]
["2017 Quarter 2",19011181,11640437,110568703,145012384,286232705,{"$nulls":15},61,"Educational Services"]
["2017 Quarter 3",17093582,14248505,116593598,156299435,304235120,{"$nulls":15},62,"Health Care and Social Assistance"]
["2017 Quarter 4",14179705,12508426,117482190,151012864,295183185,{"$nulls":15},71,"Arts, Entertainment, and Recreation"]
["2018 Quarter 1",13911536,10242984,110736525,138025689,272916734,{"$nulls":15},72,"Accommodation and Food Services"]
["2018 Quarter 2",16990270,12317065,123303018,161181907,313792260,{"$nulls":15},81,"Other Services (except Public Administration)"]
["2018 Quarter 3",17830355,14888961,126765864,170380580,329865760,{"$nulls":15},92,"Public Administration"]
["2018 Quarter 4",17887550,12403616,125515949,168591123,324398238]
["2019 Quarter 1",14677218,10249339,103242737,148049413,276218707]
["2019 Quarter 2",15736306,13460624,121208046,183790832,334195808]
["2019 Quarter 3",17164628,16212690,116898880,192719796,342995994]
["2019 Quarter 4",15728175,14230334,119392794,182011934,331363237,null,null,null,"Coupeville","Langley","Oak Harbor","Unic Is Co","All Locations"]
["2020 Quarter 1",13036976,10470110,105943414,162002235,291452735,null,null,"Median",{"$f":"MEDIAN(B5:B37)","v":16064193},{"$f":"MEDIAN(C5:C37)","v":11985075},{"$f":"MEDIAN(D5:D37)","v":110736525},{"$f":"MEDIAN(E5:E37)","v":151012864},{"$f":"MEDIAN(F5:F37)","v":291452735}]
["2021 Quarter 2",19290789,14364768,147319403,244800603,425775563,null,null,"Average",{"$f":"AVERAGE(B5:B37)","v":15408241},{"$f":"AVERAGE(C5:C37)","v":11877221.909090908},{"$f":"AVERAGE(D5:D37)","v":110336970},{"$f":"AVERAGE(E5:E37)","v":157237506.24242425},{"$f":"AVERAGE(F5:F37)","v":294859939.15151513}]
["2021 Quarter 3",21195670,17499629,146741238,251947761,437384298,null,null,"Minimum",{"$f":"MIN(B5:B37)","v":8777594},{"$f":"MIN(C5:C37)","v":7397435},{"$f":"MIN(D5:D37)","v":72683696},{"$f":"MIN(E5:E37)","v":86719458},{"$f":"MIN(F5:F37)","v":175578183}]
["2021 Quarter 4",18631063,14692489,144963790,244576913,422864255,null,null,"Maximum",{"$f":"MAX(B5:B37)","v":21195670},{"$f":"MAX(C5:C37)","v":17499629},{"$f":"MAX(D5:D37)","v":147319403},{"$f":"MAX(E5:E37)","v":251947761},{"$f":"MAX(F5:F37)","v":437384298}]
["2022 Quarter 1",17541632,13558046,136153112,232547964,399800754,null,null,"Yr Over Yr",{"$f":"B37-B33","v":-1477439},{"$f":"C37-C33","v":-2086496},{"$f":"D37-D33","v":-11374048},{"$f":"E37-E33","v":-27149219},{"$f":"F37-F33","v":-42087202}]
["2020 Quarter 2",12809076,9163680,120675843,174520115,317168714,null,null,"Yr Over Yr % Change",{"$f":"J$33/B$33","v":-8.4224717517731529E-2},{"$f":"K$33/C$33","v":-0.15389356253843658},{"$f":"L$33/D$33","v":-8.353865609770271E-2},{"$f":"M$33/E$33","v":-0.11674674993069387},{"$f":"N$33/F$33","v":-0.10527044178611029}]
["2020 Quarter 3",16928656,14149771,132288990,213235467,376602884]
["2020 Quarter 4",16904005,13869134,136150398,219001013,385924550]
["2021 Quarter 1",16064193,11471550,124779064,205398745,357713552]

{"sheet":"Total Data","index":3,"n_rows":3016,"n_cols":6,"rows_kept":3016,"cut":false,"hidden":true,"merged":[]}
["Location","Year","Tax Type","NAICS","Total Taxable","Units"]
["Unic Is Co","2014 Quarter 1","Sales",11,176914,15]
["Unic Is Co","2014 Quarter 1","Sales",21,"D","D"]
["Unic Is Co","2014 Quarter 1","Sales",22,280779,8]
["Unic Is Co","2014 Quarter 1","Sales",23,24733929,885]
["Unic Is Co","2014 Quarter 1","Sales",31,225294,90]
["Unic Is Co","2014 Quarter 1","Sales",32,910590,84]
["Unic Is Co","2014 Quarter 1","Sales",33,1162225,124]
["Unic Is Co","2014 Quarter 1","Sales",42,9522825,730]
["Unic Is Co","2014 Quarter 1","Sales",44,16758051,642]
["Unic Is Co","2014 Quarter 1","Sales",45,9724053,769]
["Unic Is Co","2014 Quarter 1","Sales",48,211267,12]
["Unic Is Co","2014 Quarter 1","Sales",49,5929,4]
["Unic Is Co","2014 Quarter 1","Sales",51,7924398,222]
["Unic Is Co","2014 Quarter 1","Sales",52,212244,41]
["Unic Is Co","2014 Quarter 1","Sales",53,814498,125]
["Unic Is Co","2014 Quarter 1","Sales",54,1355087,189]
["Unic Is Co","2014 Quarter 1","Sales",56,3341513,314]
["Unic Is Co","2014 Quarter 1","Sales",61,192201,45]
["Unic Is Co","2014 Quarter 1","Sales",62,115461,29]
["Unic Is Co","2014 Quarter 1","Sales",71,1389064,40]
["Unic Is Co","2014 Quarter 1","Sales",72,4729181,97]
["Unic Is Co","2014 Quarter 1","Sales",81,2888416,192]
["Unic Is Co","2014 Quarter 1","Sales",92,45539,6]
["Coupeville","2014 Quarter 1","Sales",11,13138,3]
["Coupeville","2014 Quarter 1","Sales",23,1308194,150]
["Coupeville","2014 Quarter 1","Sales",31,74032,18]
["Coupeville","2014 Quarter 1","Sales",32,50203,29]
["Coupeville","2014 Quarter 1","Sales",33,150082,28]
["Coupeville","2014 Quarter 1","Sales",42,1288290,315]
["Coupeville","2014 Quarter 1","Sales",44,1499059,262]
["Coupeville","2014 Quarter 1","Sales",45,1082747,354]
["Coupeville","2014 Quarter 1","Sales",49,"D","D"]
["Coupeville","2014 Quarter 1","Sales",51,644543,113]
["Coupeville","2014 Quarter 1","Sales",52,63680,25]
["Coupeville","2014 Quarter 1","Sales",53,87265,50]
["Coupeville","2014 Quarter 1","Sales",54,387872,83]
["Coupeville","2014 Quarter 1","Sales",56,310898,92]
["Coupeville","2014 Quarter 1","Sales",61,9360,16]
["Coupeville","2014 Quarter 1","Sales",62,116315,9]
{"$rows_left_out":2977}
{"sheet":"Unic Is Co","index":4,"n_rows":36,"n_cols":6,"rows_kept":36,"cut":false,"hidden":false,"merged":[]}
["NAICS","(All)",{"$f":"VLOOKUP(B1,NAICS!A1:B2600,2,FALSE)","v":{"$error":"#N/A"}}]
[]
["Row Labels","Sum of Total Taxable"]
["2012 Quarter 1",71695040]
["2012 Quarter 2",79961300]
["2012 Quarter 3",87413036]
["2012 Quarter 4",86009221]
["2013 Quarter 1",74539993]
["2013 Quarter 2",89056059]
["2013 Quarter 3",97270920]
["2013 Quarter 4",96958026]
["2014 Quarter 1",86719458]
["2014 Quarter 2",94258126]
["2014 Quarter 3",105853873]
["2014 Quarter 4",105315571]
["2015 Quarter 1",97265379]
["2015 Quarter 2",112560763]
["2015 Quarter 3",117678010]
["2015 Quarter 4",113395164]
["2016 Quarter 1",103794931]
["2016 Quarter 2",121095892]
["2016 Quarter 3",136129231]
["2016 Quarter 4",130213240]
["2017 Quarter 1",119451295]
["2017 Quarter 2",145012384]
["2017 Quarter 3",156299435,null,null,"Amounts","% Difference"]
["2017 Quarter 4",151012864,null,"Median",{"$f":"MEDIAN(B4:B36)","v":117678010},{"$f":"(B$36-E27)/E27","v":0.37665681974057857}]
["2018 Quarter 1",138025689,null,"Average",{"$f":"AVERAGE(B4:B36)","v":123809476.36363636},{"$f":"(B$36-E28)/E28","v":0.30848009181614711}]
["2018 Quarter 2",161181907,null,"Minimum",{"$f":"MIN(B4:B36)","v":71695040},{"$f":"(B$36-E29)/E29","v":1.2596017102438328}]
["2018 Quarter 3",170380580,null,"Maximum",{"$f":"MAX(B4:B36)","v":192719796},{"$f":"(B$36-E30)/E30","v":-0.15938975464668922}]
["2018 Quarter 4",168591123,null,"Yr Over Yr",{"$f":"B36-B32","v":13952822},{"$f":"E31/B36","v":8.6127342625859457E-2}]
["2019 Quarter 1",148049413]
["2019 Quarter 2",183790832]
["2019 Quarter 3",192719796]
["2019 Quarter 4",182011934]
["2020 Quarter 1",162002235]

{"sheet":"Unic Is Co Data","index":5,"n_rows":792,"n_cols":5,"rows_kept":792,"cut":false,"hidden":true,"merged":[]}
["Year","Tax Type","NAICS","Total Taxable","Units"]
["2014 Quarter 1","Sales",11,176914,15]
["2014 Quarter 1","Sales",21,"D","D"]
["2014 Quarter 1","Sales",22,280779,8]
["2014 Quarter 1","Sales",23,24733929,885]
["2014 Quarter 1","Sales",31,225294,90]
["2014 Quarter 1","Sales",32,910590,84]
["2014 Quarter 1","Sales",33,1162225,124]
["2014 Quarter 1","Sales",42,9522825,730]
["2014 Quarter 1","Sales",44,16758051,642]
["2014 Quarter 1","Sales",45,9724053,769]
["2014 Quarter 1","Sales",48,211267,12]
["2014 Quarter 1","Sales",49,5929,4]
["2014 Quarter 1","Sales",51,7924398,222]
["2014 Quarter 1","Sales",52,212244,41]
["2014 Quarter 1","Sales",53,814498,125]
["2014 Quarter 1","Sales",54,1355087,189]
["2014 Quarter 1","Sales",56,3341513,314]
["2014 Quarter 1","Sales",61,192201,45]
["2014 Quarter 1","Sales",62,115461,29]
["2014 Quarter 1","Sales",71,1389064,40]
["2014 Quarter 1","Sales",72,4729181,97]
["2014 Quarter 1","Sales",81,2888416,192]
["2014 Quarter 1","Sales",92,45539,6]
["2014 Quarter 2","Sales",11,167909,17]
["2014 Quarter 2","Sales",21,51166,3]
["2014 Quarter 2","Sales",22,289518,10]
["2014 Quarter 2","Sales",23,26001234,959]
["2014 Quarter 2","Sales",31,334957,96]
["2014 Quarter 2","Sales",32,1481837,89]
["2014 Quarter 2","Sales",33,584194,131]
["2014 Quarter 2","Sales",42,6379630,670]
["2014 Quarter 2","Sales",44,21775395,673]
["2014 Quarter 2","Sales",45,9406826,830]
["2014 Quarter 2","Sales",48,121095,11]
["2014 Quarter 2","Sales",49,12505,3]
["2014 Quarter 2","Sales",51,7751643,203]
["2014 Quarter 2","Sales",52,283092,46]
["2014 Quarter 2","Sales",53,1326315,141]
["2014 Quarter 2","Sales",54,1640746,199]
{"$rows_left_out":753}
{"sheet":"Coupeville","index":6,"n_rows":36,"n_cols":6,"rows_kept":36,"cut":false,"hidden":false,"merged":[]}
["NAICS","(All)",{"$f":"VLOOKUP(B1,NAICS!A1:B2604,2,FALSE)","v":{"$error":"#N/A"}}]
[]
["Row Labels","Sum of Total Taxable"]
["2014 Quarter 1",8777594]
["2014 Quarter 2",10657288]
["2014 Quarter 3",11924741]
["2014 Quarter 4",10237937]
["2015 Quarter 1",9519402]
["2015 Quarter 2",11073628]
["2015 Quarter 3",12691867]
["2015 Quarter 4",14284608]
["2016 Quarter 1",15076444]
["2016 Quarter 2",16452080]
["2016 Quarter 3",18081679]
["2016 Quarter 4",17726155]
["2017 Quarter 1",19355964]
["2017 Quarter 2",19011181]
["2017 Quarter 3",17093582]
["2017 Quarter 4",14179705]
["2018 Quarter 1",13911536]
["2018 Quarter 2",16990270]
["2018 Quarter 3",17830355]
["2018 Quarter 4",17887550]
["2019 Quarter 1",14677218]
["2019 Quarter 2",15736306]
["2019 Quarter 3",17164628]
["2019 Quarter 4",15728175,null,null,"Amounts","% Difference"]
["2020 Quarter 1",13036976,null,"Median",{"$f":"MEDIAN(B4:B34)","v":15736306},{"$f":"(B$36-E28)/E28","v":0.11472362065150488}]
["2020 Quarter 2",12809076,null,"Average",{"$f":"AVERAGE(B4:B34)","v":15235459.935483871},{"$f":"(B$34-E29)/E29","v":0.3912064414041489}]
["2020 Quarter 3",16928656,null,"Minimum",{"$f":"MIN(B4:B34)","v":8777594},{"$f":"(B$34-E30)/E30","v":1.4147471391363056}]
["2020 Quarter 4",16904005,null,"Maximum",{"$f":"MAX(B4:B34)","v":21195670},{"$f":"(B$34-E31)/E31","v":0}]
["2021 Quarter 1",16064193,null,"Yr Over Yr",{"$f":"B34-B30","v":4267014},{"$f":"E32/B30","v":0.25205863950451823}]
["2021 Quarter 2",19290789]
["2021 Quarter 3",21195670]
["2021 Quarter 4",18631063]
["2022 Quarter 1",17541632]

{"sheet":"Coupeville Data","index":7,"n_rows":744,"n_cols":5,"rows_kept":744,"cut":false,"hidden":true,"merged":[]}
["Year","Tax Type","NAICS","Total Taxable","Units"]
["2014 Quarter 1","Sales",11,13138,3]
["2014 Quarter 1","Sales",23,1308194,150]
["2014 Quarter 1","Sales",31,74032,18]
["2014 Quarter 1","Sales",32,50203,29]
["2014 Quarter 1","Sales",33,150082,28]
["2014 Quarter 1","Sales",42,1288290,315]
["2014 Quarter 1","Sales",44,1499059,262]
["2014 Quarter 1","Sales",45,1082747,354]
["2014 Quarter 1","Sales",49,"D","D"]
["2014 Quarter 1","Sales",51,644543,113]
["2014 Quarter 1","Sales",52,63680,25]
["2014 Quarter 1","Sales",53,87265,50]
["2014 Quarter 1","Sales",54,387872,83]
["2014 Quarter 1","Sales",56,310898,92]
["2014 Quarter 1","Sales",61,9360,16]
["2014 Quarter 1","Sales",62,116315,9]
["2014 Quarter 1","Sales",71,77206,7]
["2014 Quarter 1","Sales",72,1415167,28]
["2014 Quarter 1","Sales",81,197219,44]
["2014 Quarter 1","Sales",92,2324,3]
["2014 Quarter 2","Sales",11,47960,4]
["2014 Quarter 2","Sales",22,"D","D"]
["2014 Quarter 2","Sales",23,1633220,178]
["2014 Quarter 2","Sales",31,118034,20]
["2014 Quarter 2","Sales",32,65831,31]
["2014 Quarter 2","Sales",33,338766,26]
["2014 Quarter 2","Sales",42,1237663,327]
["2014 Quarter 2","Sales",44,1662347,283]
["2014 Quarter 2","Sales",45,1290782,358]
["2014 Quarter 2","Sales",49,"D","D"]
["2014 Quarter 2","Sales",51,684746,123]
["2014 Quarter 2","Sales",52,60493,24]
["2014 Quarter 2","Sales",53,100365,48]
["2014 Quarter 2","Sales",54,397762,80]
["2014 Quarter 2","Sales",56,414898,87]
["2014 Quarter 2","Sales",61,88957,19]
["2014 Quarter 2","Sales",62,117296,11]
["2014 Quarter 2","Sales",71,84510,9]
["2014 Quarter 2","Sales",72,2034103,29]
{"$rows_left_out":705}
{"sheet":"Langley","index":8,"n_rows":36,"n_cols":6,"rows_kept":36,"cut":false,"hidden":false,"merged":[]}
["NAICS","(All)",{"$f":"VLOOKUP(B1,NAICS!A1:B2604,2,FALSE)","v":{"$error":"#N/A"}}]
[]
["Row Labels","Sum of Total Taxable"]
["2014 Quarter 1",7397435]
["2014 Quarter 2",9145967]
["2014 Quarter 3",11487725]
["2014 Quarter 4",9154497]
["2015 Quarter 1",7811245]
["2015 Quarter 2",8989338]
["2015 Quarter 3",12271285]
["2015 Quarter 4",10506084]
["2016 Quarter 1",8312506]
["2016 Quarter 2",10359931]
["2016 Quarter 3",13416735]
["2016 Quarter 4",11985075]
["2017 Quarter 1",9468342]
["2017 Quarter 2",11640437]
["2017 Quarter 3",14248505]
["2017 Quarter 4",12508426]
["2018 Quarter 1",10242984]
["2018 Quarter 2",12317065]
["2018 Quarter 3",14888961]
["2018 Quarter 4",12403616]
["2019 Quarter 1",10249339]
["2019 Quarter 2",13460624]
["2019 Quarter 3",16212690]
["2019 Quarter 4",14230334]
["2020 Quarter 1",10470110]
["2020 Quarter 2",9163680,null,null,"Amounts","% Difference"]
["2020 Quarter 3",14149771,null,"Median",{"$f":"MEDIAN(B4:B36)","v":11985075},{"$f":"(B$36-E30)/E30","v":0.13124415158019453}]
["2020 Quarter 4",13869134,null,"Average",{"$f":"AVERAGE(B4:B36)","v":11877221.909090908},{"$f":"(B$36-E31)/E31","v":0.14151660243230593}]
["2021 Quarter 1",11471550,null,"Minimum",{"$f":"MIN(B4:B36)","v":7397435},{"$f":"(B$36-E32)/E32","v":0.83280366775781067}]
["2021 Quarter 2",14364768,null,"Maximum",{"$f":"MAX(B4:B36)","v":17499629},{"$f":"(B$36-E33)/E33","v":-0.22523808933320816}]
["2021 Quarter 3",17499629,null,"Yr Over Yr",{"$f":"B36-B32","v":2086496},{"$f":"E36/B30","v":0}]
["2021 Quarter 4",14692489]
["2022 Quarter 1",13558046]

{"sheet":"Langley Data","index":9,"n_rows":713,"n_cols":5,"rows_kept":713,"cut":false,"hidden":true,"merged":[]}
["Year","Tax Type","NAICS","Total Taxable","Units"]
["2014 Quarter 1","Sales",11,"D","D"]
["2014 Quarter 1","Sales",22,"D","D"]
["2014 Quarter 1","Sales",23,1306304,119]
["2014 Quarter 1","Sales",31,70862,19]
["2014 Quarter 1","Sales",32,47105,22]
["2014 Quarter 1","Sales",33,41624,14]
["2014 Quarter 1","Sales",42,985637,238]
["2014 Quarter 1","Sales",44,582040,210]
["2014 Quarter 1","Sales",45,1581043,304]
["2014 Quarter 1","Sales",48,"D","D"]
["2014 Quarter 1","Sales",51,285165,97]
["2014 Quarter 1","Sales",52,53648,25]
["2014 Quarter 1","Sales",53,58633,38]
["2014 Quarter 1","Sales",54,107977,69]
["2014 Quarter 1","Sales",56,298641,71]
["2014 Quarter 1","Sales",61,5865,14]
["2014 Quarter 1","Sales",62,1173,7]
["2014 Quarter 1","Sales",71,30494,7]
["2014 Quarter 1","Sales",72,1667480,12]
["2014 Quarter 1","Sales",81,273744,43]
["2014 Quarter 2","Sales",11,"D","D"]
["2014 Quarter 2","Sales",22,"D","D"]
["2014 Quarter 2","Sales",23,1756797,134]
["2014 Quarter 2","Sales",31,103285,17]
["2014 Quarter 2","Sales",32,105225,28]
["2014 Quarter 2","Sales",33,40392,22]
["2014 Quarter 2","Sales",42,711946,230]
["2014 Quarter 2","Sales",44,665256,230]
["2014 Quarter 2","Sales",45,2018143,337]
["2014 Quarter 2","Sales",48,"D","D"]
["2014 Quarter 2","Sales",51,377120,97]
["2014 Quarter 2","Sales",52,60448,29]
["2014 Quarter 2","Sales",53,66766,44]
["2014 Quarter 2","Sales",54,151636,67]
["2014 Quarter 2","Sales",56,284378,65]
["2014 Quarter 2","Sales",61,14764,19]
["2014 Quarter 2","Sales",62,2422,5]
["2014 Quarter 2","Sales",71,38768,6]
["2014 Quarter 2","Sales",72,2373439,14]
{"$rows_left_out":674}
{"sheet":"Oak Harbor","index":10,"n_rows":67,"n_cols":6,"rows_kept":67,"cut":false,"hidden":false,"merged":[]}
["NAICS","(All)",{"$f":"VLOOKUP(B1,NAICS!A1:B2604,2,FALSE)","v":{"$error":"#N/A"}}]
[]
["Row Labels","Sum of Total Taxable"]
["2014 Quarter 1",72683696]
["2014 Quarter 2",80928322]
["2014 Quarter 3",83749226]
["2014 Quarter 4",81271950]
["2015 Quarter 1",75790719]
["2015 Quarter 2",87666274]
["2015 Quarter 3",92829278]
["2015 Quarter 4",90965132]
["2016 Quarter 1",85008881]
["2016 Quarter 2",102904792]
["2016 Quarter 3",105459441]
["2016 Quarter 4",100246743]
["2017 Quarter 1",94892000]
["2017 Quarter 2",110568703]
["2017 Quarter 3",116593598]
["2017 Quarter 4",117482190]
["2018 Quarter 1",110736525]
["2018 Quarter 2",123303018]
["2018 Quarter 3",126765864]
["2018 Quarter 4",125515949]
["2019 Quarter 1",103242737]
["2019 Quarter 2",121208046]
["2019 Quarter 3",116898880]
["2019 Quarter 4",119392794]
["2020 Quarter 1",105943414]
["2020 Quarter 2",120675843,null,null,"Amounts","% Difference"]
["2020 Quarter 3",132288990,null,"Median",{"$f":"MEDIAN(B4:B36)","v":110736525},{"$f":"(B$36-E30)/E30","v":0.22952306838236075}]
["2020 Quarter 4",136150398,null,"Average",{"$f":"AVERAGE(B4:B36)","v":110336970},{"$f":"(B$36-E31)/E31","v":0.23397544812042601}]
["2021 Quarter 1",124779064,null,"Minimum",{"$f":"MIN(B4:B36)","v":72683696},{"$f":"(B$36-E32)/E32","v":0.87322769056763427}]
["2021 Quarter 2",147319403,null,"Maximum",{"$f":"MAX(B4:B36)","v":147319403},{"$f":"(B$36-E33)/E33","v":-7.5796471969140411E-2}]
["2021 Quarter 3",146741238,null,"Yr Over Yr",{"$f":"B36-B32","v":11374048},{"$f":"E36/B30","v":0}]
["2021 Quarter 4",144963790]
["2022 Quarter 1",136153112]
{"$rows_empty":30}
[null,null,"-"]

{"sheet":"Oak Harbor Data","index":11,"n_rows":770,"n_cols":5,"rows_kept":770,"cut":false,"hidden":true,"merged":[]}
["Year","Tax Type","NAICS","Total Taxable","Units"]
["2014 Quarter 1","Sales",11,"D","D"]
["2014 Quarter 1","Sales",21,"D","D"]
["2014 Quarter 1","Sales",22,101351,3]
["2014 Quarter 1","Sales",23,5260207,384]
["2014 Quarter 1","Sales",31,215978,51]
["2014 Quarter 1","Sales",32,675797,62]
["2014 Quarter 1","Sales",33,264533,81]
["2014 Quarter 1","Sales",42,4118616,682]
["2014 Quarter 1","Sales",44,22976557,480]
["2014 Quarter 1","Sales",45,17429363,674]
["2014 Quarter 1","Sales",48,13545,3]
["2014 Quarter 1","Sales",49,"D","D"]
["2014 Quarter 1","Sales",51,3604496,224]
["2014 Quarter 1","Sales",52,583975,51]
["2014 Quarter 1","Sales",53,1389978,113]
["2014 Quarter 1","Sales",54,1146350,166]
["2014 Quarter 1","Sales",56,1180323,195]
["2014 Quarter 1","Sales",61,114627,37]
["2014 Quarter 1","Sales",62,18340,17]
["2014 Quarter 1","Sales",71,759676,16]
["2014 Quarter 1","Sales",72,10771963,72]
["2014 Quarter 1","Sales",81,2041662,150]
["2014 Quarter 1","Sales",92,16359,4]
["2014 Quarter 2","Sales",11,7604,4]
["2014 Quarter 2","Sales",22,173820,3]
["2014 Quarter 2","Sales",23,6029851,414]
["2014 Quarter 2","Sales",31,332790,45]
["2014 Quarter 2","Sales",32,1027741,74]
["2014 Quarter 2","Sales",33,477301,105]
["2014 Quarter 2","Sales",42,4028002,648]
["2014 Quarter 2","Sales",44,27745823,501]
["2014 Quarter 2","Sales",45,16935654,715]
["2014 Quarter 2","Sales",48,39311,5]
["2014 Quarter 2","Sales",49,4809,3]
["2014 Quarter 2","Sales",51,3789611,223]
["2014 Quarter 2","Sales",52,786250,56]
["2014 Quarter 2","Sales",53,1639305,104]
["2014 Quarter 2","Sales",54,1214555,164]
["2014 Quarter 2","Sales",56,1579350,193]
{"$rows_left_out":731}
{"sheet":"NAICS","index":12,"n_rows":2307,"n_cols":2,"rows_kept":2307,"cut":false,"hidden":false,"merged":[]}
["NAICS Code","NAICS Title"]
[11,"Agriculture, Forestry, Fishing and Hunting"]
[111,"Crop Production "]
[1111,"Oilseed and Grain Farming"]
[11111,"Soybean Farming"]
[111110,"Soybean Farming"]
[11112,"Oilseed (except Soybean) Farming "]
[111120,"Oilseed (except Soybean) Farming "]
[11113,"Dry Pea and Bean Farming"]
[111130,"Dry Pea and Bean Farming "]
[11114,"Wheat Farming"]
[111140,"Wheat Farming"]
[11115,"Corn Farming"]
[111150,"Corn Farming "]
[11116,"Rice Farming"]
[111160,"Rice Farming"]
[11119,"Other Grain Farming"]
[111191,"Oilseed and Grain Combination Farming "]
[111199,"All Other Grain Farming "]
[1112,"Vegetable and Melon Farming "]
[11121,"Vegetable and Melon Farming"]
[111211,"Potato Farming "]
[111219,"Other Vegetable (except Potato) and Melon Farming "]
[1113,"Fruit and Tree Nut Farming "]
[11131,"Orange Groves"]
[111310,"Orange Groves"]
[11132,"Citrus (except Orange) Groves "]
[111320,"Citrus (except Orange) Groves "]
[11133,"Noncitrus Fruit and Tree Nut Farming"]
[111331,"Apple Orchards "]
[111332,"Grape Vineyards "]
[111333,"Strawberry Farming "]
[111334,"Berry (except Strawberry) Farming "]
[111335,"Tree Nut Farming "]
[111336,"Fruit and Tree Nut Combination Farming "]
[111339,"Other Noncitrus Fruit Farming "]
[1114,"Greenhouse, Nursery, and Floriculture Production "]
[11141,"Food Crops Grown Under Cover"]
[111411,"Mushroom Production "]
[111419,"Other Food Crops Grown Under Cover "]
{"$rows_left_out":2267}